View Single Post
Old 2021-05-26, 20:22   #3
henryzz
Just call me Henry
 
henryzz's Avatar
 
"David"
Sep 2007
Cambridge (GMT/BST)

10111000100002 Posts
Default

That moved the compilation further on. The error is now:

Code:
[  0%] Building gf2x
Making all in lowlevel
Making all in src
Making all in .
Making all in fft
Making all in tests
[  0%] Built target gf2x-build
[  0%] Generating list of modified files in working tree
[  0%] Built target list_modified_files
[  0%] Building CXX object utils/CMakeFiles/utils.dir/timing.cpp.o
/mnt/e/Downloads/cado-nfs-master-210526/cado-nfs-master/build/DESKTOP-BVMNJE2/cxxwrap.pl: 1: ccwrap.pl.in: not found
make[2]: *** [utils/CMakeFiles/utils.dir/build.make:76: utils/CMakeFiles/utils.dir/timing.cpp.o] Error 127
make[1]: *** [CMakeFiles/Makefile2:1753: utils/CMakeFiles/utils.dir/all] Error 2
make: *** [Makefile:141: all] Error 2
make: *** [Makefile:7: all] Error 2
I have tried copying ccwrap.pl.in to various places with no luck.
henryzz is offline   Reply With Quote